Information card for entry 7049419
Formula | C86 H92 Cd2 N12 O25 P2 |
Calculated formula | C86 H62 Cd2 N12 O10 P2 |
Title of publication | Variation of topologies and entanglements in metal-organic frameworks with mixed tris[4-(1H-imidazol-1-yl)phenyl]phosphine oxide and dicarboxylate ligands. |
Authors of publication | Sun, Yingying; Chen, Xiaojie; Wang, Fengyuan; Ma, Ruidan; Guo, Xianmin; Sun, Shaowen; Guo, Huadong; Alexandrov, Eugeny V. |
Journal of publication | Dalton transactions (Cambridge, England : 2003) |
Year of publication | 2019 |
Journal volume | 48 |
Journal issue | 16 |
Pages of publication | 5450 - 5458 |
a | 10.088 ± 0.005 Å |
b | 15.743 ± 0.005 Å |
c | 18.126 ± 0.005 Å |
α | 111.637 ± 0.005° |
β | 100.107 ± 0.005° |
γ | 94.589 ± 0.005° |
Cell volume | 2601.2 ± 1.7 Å3 |
Cell temperature | 293 ± 2 K |
Ambient diffraction temperature | 293 ± 2 K |
Number of distinct elements | 6 |
Space group number | 2 |
Hermann-Mauguin space group symbol | P -1 |
Hall space group symbol | -P 1 |
Residual factor for all reflections | 0.0668 |
Residual factor for significantly intense reflections | 0.0479 |
Weighted residual factors for significantly intense reflections | 0.1292 |
Weighted residual factors for all reflections included in the refinement | 0.1368 |
Goodness-of-fit parameter for all reflections included in the refinement | 0.997 |
Diffraction radiation wavelength | 0.71069 Å |
Diffraction radiation type | MoKα |