Information card for entry 7049431
Formula | C49 H37 Cl4 F6 N6 P Pt2 |
Calculated formula | C49 H37 Cl4 F6 N6 P Pt2 |
Title of publication | Luminescent properties of a 3,5-diphenylpyrazole bridged Pt(ii) dimer. |
Authors of publication | Cinninger, Leander M.; Bastatas, Lyndon D.; Shen, Yulong; Holliday, Bradley J.; Slinker, Jason D. |
Journal of publication | Dalton transactions (Cambridge, England : 2003) |
Year of publication | 2019 |
Journal volume | 48 |
Journal issue | 26 |
Pages of publication | 9684 - 9691 |
a | 13.3294 ± 0.0002 Å |
b | 14.2532 ± 0.0002 Å |
c | 15.219 ± 0.0003 Å |
α | 116.327 ± 0.002° |
β | 110.712 ± 0.002° |
γ | 95.005 ± 0.001° |
Cell volume | 2318.99 ± 0.1 Å3 |
Cell temperature | 100 ± 2 K |
Ambient diffraction temperature | 100 ± 2 K |
Number of distinct elements | 7 |
Space group number | 2 |
Hermann-Mauguin space group symbol | P -1 |
Hall space group symbol | -P 1 |
Residual factor for all reflections | 0.0204 |
Residual factor for significantly intense reflections | 0.02 |
Weighted residual factors for significantly intense reflections | 0.0507 |
Weighted residual factors for all reflections included in the refinement | 0.051 |
Goodness-of-fit parameter for all reflections included in the refinement | 1.127 |
Diffraction radiation wavelength | 1.54184 Å |
Diffraction radiation type | CuKα |