Information card for entry 7049467
Formula | C20 H20 Cl3 N O Ru |
Calculated formula | C20 H20 Cl3 N O Ru |
Title of publication | Discovery of high in vitro and in vivo antitumor activities of organometallic ruthenium(ii)-arene complexes with 5,7-dihalogenated-2-methyl-8-quinolinol. |
Authors of publication | Meng, Ting; Qin, Qi-Pin; Chen, Zi-Lu; Zou, Hua-Hong; Wang, Kai; Liang, Fu-Pei |
Journal of publication | Dalton transactions (Cambridge, England : 2003) |
Year of publication | 2019 |
Journal volume | 48 |
Journal issue | 16 |
Pages of publication | 5352 - 5360 |
a | 14.5834 ± 0.0003 Å |
b | 8.19777 ± 0.00016 Å |
c | 16.7486 ± 0.0004 Å |
α | 90° |
β | 102.21 ± 0.002° |
γ | 90° |
Cell volume | 1957.02 ± 0.07 Å3 |
Cell temperature | 293 ± 2 K |
Ambient diffraction temperature | 293 ± 2 K |
Number of distinct elements | 6 |
Space group number | 14 |
Hermann-Mauguin space group symbol | P 1 21/n 1 |
Hall space group symbol | -P 2yn |
Residual factor for all reflections | 0.0339 |
Residual factor for significantly intense reflections | 0.027 |
Weighted residual factors for significantly intense reflections | 0.0607 |
Weighted residual factors for all reflections included in the refinement | 0.0649 |
Goodness-of-fit parameter for all reflections included in the refinement | 1.065 |
Diffraction radiation probe | x-ray |
Diffraction radiation wavelength | 0.71073 Å |
Diffraction radiation type | MoKα |