Information card for entry 7049482
Formula | C14 H10 Ag F5 N2 O4 S |
Calculated formula | C14 H10 Ag F5 N2 O4 S |
Title of publication | Supramolecular topology design of silver(i) and copper(ii) coordination polymers through a new semi-rigid sulfonyl ligand with different anion templates. |
Authors of publication | Qin, Zhaoxian; Zhao, Li; Li, Zhiwen; Tian, Shanli; Xiao, Qian; Deng, Yuheng; Zhang, Jiangwei; Li, Gao; Wan, Chongqing |
Journal of publication | Dalton transactions (Cambridge, England : 2003) |
Year of publication | 2019 |
Journal volume | 48 |
Journal issue | 20 |
Pages of publication | 6730 - 6737 |
a | 13.5906 ± 0.0005 Å |
b | 15.3623 ± 0.0006 Å |
c | 16.9588 ± 0.0006 Å |
α | 90° |
β | 90° |
γ | 90° |
Cell volume | 3540.7 ± 0.2 Å3 |
Cell temperature | 296 ± 2 K |
Ambient diffraction temperature | 296.15 K |
Number of distinct elements | 7 |
Space group number | 61 |
Hermann-Mauguin space group symbol | P b c a |
Hall space group symbol | -P 2ac 2ab |
Residual factor for all reflections | 0.0347 |
Residual factor for significantly intense reflections | 0.0279 |
Weighted residual factors for significantly intense reflections | 0.0678 |
Weighted residual factors for all reflections included in the refinement | 0.0721 |
Goodness-of-fit parameter for all reflections included in the refinement | 1.036 |
Diffraction radiation wavelength | 0.71073 Å |
Diffraction radiation type | MoKα |