Information card for entry 7049560
Formula | C25 H16 Cu F12 N4 O2 P2 |
Calculated formula | C25 H16 Cu F12 N4 O2 P2 |
Title of publication | Aerobic oxygenation catalyzed by first row transition metal complexes coordinated by tetradentate mono-carbon bridged bis-phenanthroline ligands: intra- versus intermolecular carbon-hydrogen bond activation. |
Authors of publication | Shen, Kaiji; Diskin-Posner, Yael; Shimon, Linda J. W.; Leitus, Gregory; Carmieli, Raanan; Neumann, Ronny |
Journal of publication | Dalton transactions (Cambridge, England : 2003) |
Year of publication | 2019 |
Journal volume | 48 |
Journal issue | 19 |
Pages of publication | 6396 - 6407 |
a | 11.627 ± 0.0001 Å |
b | 14.478 ± 0.0001 Å |
c | 16.6429 ± 0.0002 Å |
α | 90° |
β | 109.253 ± 0.001° |
γ | 90° |
Cell volume | 2644.91 ± 0.05 Å3 |
Cell temperature | 150 ± 2 K |
Ambient diffraction temperature | 150 ± 2 K |
Number of distinct elements | 7 |
Space group number | 14 |
Hermann-Mauguin space group symbol | P 1 21/n 1 |
Hall space group symbol | -P 2yn |
Residual factor for all reflections | 0.0417 |
Residual factor for significantly intense reflections | 0.039 |
Weighted residual factors for significantly intense reflections | 0.1095 |
Weighted residual factors for all reflections included in the refinement | 0.1118 |
Goodness-of-fit parameter for all reflections included in the refinement | 1.025 |
Diffraction radiation wavelength | 1.54184 Å |
Diffraction radiation type | CuKα |