Information card for entry 7049563
Formula | C31 H27 Cu F12 N5 P2 |
Calculated formula | C31 H27 Cu F12 N5 P2 |
Title of publication | Aerobic oxygenation catalyzed by first row transition metal complexes coordinated by tetradentate mono-carbon bridged bis-phenanthroline ligands: intra- versus intermolecular carbon-hydrogen bond activation. |
Authors of publication | Shen, Kaiji; Diskin-Posner, Yael; Shimon, Linda J. W.; Leitus, Gregory; Carmieli, Raanan; Neumann, Ronny |
Journal of publication | Dalton transactions (Cambridge, England : 2003) |
Year of publication | 2019 |
Journal volume | 48 |
Journal issue | 19 |
Pages of publication | 6396 - 6407 |
a | 14.5775 ± 0.0001 Å |
b | 13.1921 ± 0.0001 Å |
c | 16.6972 ± 0.0001 Å |
α | 90° |
β | 98.116 ± 0.001° |
γ | 90° |
Cell volume | 3178.84 ± 0.04 Å3 |
Cell temperature | 100 ± 2 K |
Ambient diffraction temperature | 100 ± 2 K |
Number of distinct elements | 6 |
Space group number | 14 |
Hermann-Mauguin space group symbol | P 1 21/c 1 |
Hall space group symbol | -P 2ybc |
Residual factor for all reflections | 0.0507 |
Residual factor for significantly intense reflections | 0.0484 |
Weighted residual factors for significantly intense reflections | 0.1367 |
Weighted residual factors for all reflections included in the refinement | 0.1386 |
Goodness-of-fit parameter for all reflections included in the refinement | 1.107 |
Diffraction radiation wavelength | 1.54184 Å |
Diffraction radiation type | CuKα |