Information card for entry 7049572
Formula | C19 H44 B N3 Si2 |
Calculated formula | C19 H44 B N3 Si2 |
Title of publication | Reactivity of an NHC-stabilized pyramidal hydrosilylene with electrophilic boron sources. |
Authors of publication | Dübek, Gizem; Franz, Daniel; Eisenhut, Carsten; Altmann, Philipp J.; Inoue, Shigeyoshi |
Journal of publication | Dalton transactions (Cambridge, England : 2003) |
Year of publication | 2019 |
Journal volume | 48 |
Journal issue | 17 |
Pages of publication | 5756 - 5765 |
a | 8.3084 ± 0.0007 Å |
b | 8.579 ± 0.0007 Å |
c | 19.8196 ± 0.0016 Å |
α | 81.99 ± 0.003° |
β | 81.622 ± 0.003° |
γ | 61.427 ± 0.002° |
Cell volume | 1223.45 ± 0.18 Å3 |
Cell temperature | 100 K |
Ambient diffraction temperature | 100 K |
Number of distinct elements | 5 |
Space group number | 2 |
Hermann-Mauguin space group symbol | P -1 |
Hall space group symbol | -P 1 |
Residual factor for all reflections | 0.0584 |
Residual factor for significantly intense reflections | 0.0509 |
Weighted residual factors for significantly intense reflections | 0.1179 |
Weighted residual factors for all reflections included in the refinement | 0.1258 |
Goodness-of-fit parameter for all reflections included in the refinement | 1.134 |
Diffraction radiation probe | x-ray |
Diffraction radiation wavelength | 0.71073 Å |
Diffraction radiation type | MoKα |