Information card for entry 7049610
Formula | C58 H82 B2 Mg2 N4 O6 |
Calculated formula | C58 H82 B2 Mg2 N4 O6 |
Title of publication | The complex reactivity of β-diketiminato magnesium(i) dimers towards pinacolborane: implications for catalysis. |
Authors of publication | Jones, Dafydd D. L.; Matthews, Aidan J. R.; Jones, Cameron |
Journal of publication | Dalton transactions (Cambridge, England : 2003) |
Year of publication | 2019 |
Journal volume | 48 |
Journal issue | 17 |
Pages of publication | 5785 - 5792 |
a | 15.0677 ± 0.0003 Å |
b | 11.9199 ± 0.0002 Å |
c | 16.282 ± 0.0004 Å |
α | 90° |
β | 91.4 ± 0.002° |
γ | 90° |
Cell volume | 2923.46 ± 0.1 Å3 |
Cell temperature | 123 ± 2 K |
Ambient diffraction temperature | 123 ± 2 K |
Number of distinct elements | 6 |
Space group number | 14 |
Hermann-Mauguin space group symbol | P 1 21/n 1 |
Hall space group symbol | -P 2yn |
Residual factor for all reflections | 0.0759 |
Residual factor for significantly intense reflections | 0.0664 |
Weighted residual factors for significantly intense reflections | 0.1847 |
Weighted residual factors for all reflections included in the refinement | 0.1958 |
Goodness-of-fit parameter for all reflections included in the refinement | 1.063 |
Diffraction radiation wavelength | 1.54184 Å |
Diffraction radiation type | CuKα |