Information card for entry 7049636
Formula | C57 H47 F6 Ir N6 |
Calculated formula | C57 H47 F6 Ir N6 |
Title of publication | Bipyridine-based iridium(iii) triplet emitters for organic light-emitting diodes (OLEDs): application and impact of phenyl substitution at the 5'-position of the N-coordinating pyridine ring. |
Authors of publication | Zaen, Rena; Kim, Myeongbee; Park, Ki-Min; Lee, Kyung Hyung; Lee, Jun Yeob; Kang, Youngjin |
Journal of publication | Dalton transactions (Cambridge, England : 2003) |
Year of publication | 2019 |
Journal volume | 48 |
Journal issue | 26 |
Pages of publication | 9734 - 9743 |
a | 38.0031 ± 0.0011 Å |
b | 12.5069 ± 0.0004 Å |
c | 19.691 ± 0.0006 Å |
α | 90° |
β | 92.0785 ± 0.0019° |
γ | 90° |
Cell volume | 9353 ± 0.5 Å3 |
Cell temperature | 173 ± 2 K |
Ambient diffraction temperature | 173 ± 2 K |
Number of distinct elements | 5 |
Space group number | 15 |
Hermann-Mauguin space group symbol | C 1 2/c 1 |
Hall space group symbol | -C 2yc |
Residual factor for all reflections | 0.0725 |
Residual factor for significantly intense reflections | 0.0454 |
Weighted residual factors for significantly intense reflections | 0.1033 |
Weighted residual factors for all reflections included in the refinement | 0.1153 |
Goodness-of-fit parameter for all reflections included in the refinement | 1.041 |
Diffraction radiation wavelength | 0.71073 Å |
Diffraction radiation type | MoKα |