Information card for entry 7049641
Formula | C78 H84 Al2 Na2 O2 |
Calculated formula | C78 H84 Al2 Na2 O2 |
SMILES | C[Al](C)(C)Oc1c(cc(cc1C(c1ccccc1)c1ccccc1)C(C)(C)C)C(c1ccccc1)c1ccccc1.[Na+] |
Title of publication | Heterobimetallic aluminate derivatives with bulky phenoxide ligands: a catalyst for selective vinyl polymerization. |
Authors of publication | Palenzuela, Miguel; Muñoz, Mª Teresa; Vega, Juan F.; Gutiérrez-Rodríguez, Ángel; Cuenca, Tomás; Mosquera, Marta E. G. |
Journal of publication | Dalton transactions (Cambridge, England : 2003) |
Year of publication | 2019 |
Journal volume | 48 |
Journal issue | 19 |
Pages of publication | 6435 - 6444 |
a | 15.365 ± 0.005 Å |
b | 9.989 ± 0.003 Å |
c | 29.599 ± 0.011 Å |
α | 90° |
β | 103.43 ± 0.03° |
γ | 90° |
Cell volume | 4419 ± 3 Å3 |
Cell temperature | 200 ± 2 K |
Ambient diffraction temperature | 200 ± 2 K |
Number of distinct elements | 5 |
Space group number | 14 |
Hermann-Mauguin space group symbol | P 1 21/n 1 |
Hall space group symbol | -P 2yn |
Residual factor for all reflections | 0.1356 |
Residual factor for significantly intense reflections | 0.0871 |
Weighted residual factors for significantly intense reflections | 0.2037 |
Weighted residual factors for all reflections included in the refinement | 0.2334 |
Goodness-of-fit parameter for all reflections included in the refinement | 1.032 |
Diffraction radiation probe | x-ray |
Diffraction radiation wavelength | 0.71073 Å |
Diffraction radiation type | MoKα |