Information card for entry 7049657
Formula | C24 H34 N4 Ni O13 S2 U |
Calculated formula | C24 H32 N4 Ni O13 S2 U |
Title of publication | The sulfonate group as a ligand: a fine balance between hydrogen bonding and metal ion coordination in uranyl ion complexes. |
Authors of publication | Thuéry, Pierre; Atoini, Youssef; Harrowfield, Jack |
Journal of publication | Dalton transactions (Cambridge, England : 2003) |
Year of publication | 2019 |
Journal volume | 48 |
Journal issue | 24 |
Pages of publication | 8756 - 8772 |
a | 9.8537 ± 0.0002 Å |
b | 15.8019 ± 0.0006 Å |
c | 20.3332 ± 0.0007 Å |
α | 90° |
β | 99.894 ± 0.002° |
γ | 90° |
Cell volume | 3118.94 ± 0.17 Å3 |
Cell temperature | 100 ± 2 K |
Ambient diffraction temperature | 100 ± 2 K |
Number of distinct elements | 7 |
Space group number | 14 |
Hermann-Mauguin space group symbol | P 1 21/n 1 |
Hall space group symbol | -P 2yn |
Residual factor for all reflections | 0.0301 |
Residual factor for significantly intense reflections | 0.0254 |
Weighted residual factors for significantly intense reflections | 0.067 |
Weighted residual factors for all reflections included in the refinement | 0.0688 |
Goodness-of-fit parameter for all reflections included in the refinement | 1.093 |
Diffraction radiation wavelength | 0.71073 Å |
Diffraction radiation type | MoKα |