Information card for entry 7049660
Formula | C24 H36 N4 Ni O14 S2 U |
Calculated formula | C24 H36 N4 Ni O14 S2 U |
Title of publication | The sulfonate group as a ligand: a fine balance between hydrogen bonding and metal ion coordination in uranyl ion complexes. |
Authors of publication | Thuéry, Pierre; Atoini, Youssef; Harrowfield, Jack |
Journal of publication | Dalton transactions (Cambridge, England : 2003) |
Year of publication | 2019 |
Journal volume | 48 |
Journal issue | 24 |
Pages of publication | 8756 - 8772 |
a | 10.6905 ± 0.0005 Å |
b | 14.6528 ± 0.0006 Å |
c | 9.9092 ± 0.0003 Å |
α | 90° |
β | 91.272 ± 0.003° |
γ | 90° |
Cell volume | 1551.85 ± 0.11 Å3 |
Cell temperature | 100 ± 2 K |
Ambient diffraction temperature | 100 ± 2 K |
Number of distinct elements | 7 |
Space group number | 14 |
Hermann-Mauguin space group symbol | P 1 21/c 1 |
Hall space group symbol | -P 2ybc |
Residual factor for all reflections | 0.0275 |
Residual factor for significantly intense reflections | 0.02 |
Weighted residual factors for significantly intense reflections | 0.0503 |
Weighted residual factors for all reflections included in the refinement | 0.0525 |
Goodness-of-fit parameter for all reflections included in the refinement | 1.038 |
Diffraction radiation wavelength | 0.71073 Å |
Diffraction radiation type | MoKα |