Information card for entry 7049681
Formula |
C26 H34 Br N3 |
Calculated formula |
C26 H34 Br N3 |
Title of publication |
4-Halo-1,2,3-triazolylidenes: stable carbenes featuring halogen bonding. |
Authors of publication |
Xu, Xingyu; Zhang, Zengyu; Huang, Shiqing; Cao, Lei; Liu, Wei; Yan, Xiaoyu |
Journal of publication |
Dalton transactions (Cambridge, England : 2003) |
Year of publication |
2019 |
Journal volume |
48 |
Journal issue |
20 |
Pages of publication |
6931 - 6941 |
a |
10.7666 ± 0.0005 Å |
b |
19.2037 ± 0.001 Å |
c |
11.8245 ± 0.0005 Å |
α |
90° |
β |
92.691 ± 0.002° |
γ |
90° |
Cell volume |
2442.1 ± 0.2 Å3 |
Cell temperature |
150 ± 2 K |
Ambient diffraction temperature |
150.02 K |
Number of distinct elements |
4 |
Space group number |
14 |
Hermann-Mauguin space group symbol |
P 1 21/n 1 |
Hall space group symbol |
-P 2yn |
Residual factor for all reflections |
0.0537 |
Residual factor for significantly intense reflections |
0.0378 |
Weighted residual factors for significantly intense reflections |
0.0828 |
Weighted residual factors for all reflections included in the refinement |
0.0883 |
Goodness-of-fit parameter for all reflections included in the refinement |
1.04 |
Diffraction radiation wavelength |
0.71073 Å |
Diffraction radiation type |
MoKα |
Yes |
No |
No |