Information card for entry 7049695
Formula | C12 H22 N14 Ni1.41 O16 Zn0.59 |
Calculated formula | C12 H22 N14 Ni1.41 O16 Zn0.59 |
Title of publication | Syntheses of mono and bimetallic cyamelurate polymers with reversible chromic behaviour. |
Authors of publication | Mohan, Midhun; Rajak, Sanil; Tremblay, Alexandre A.; Maris, Thierry; Duong, Adam |
Journal of publication | Dalton transactions (Cambridge, England : 2003) |
Year of publication | 2019 |
Journal volume | 48 |
Journal issue | 20 |
Pages of publication | 7006 - 7014 |
a | 7.3891 ± 0.0003 Å |
b | 8.6307 ± 0.0003 Å |
c | 9.1887 ± 0.0004 Å |
α | 77.928 ± 0.002° |
β | 84.47 ± 0.002° |
γ | 87.086 ± 0.002° |
Cell volume | 570.08 ± 0.04 Å3 |
Cell temperature | 100 K |
Ambient diffraction temperature | 100 K |
Number of distinct elements | 6 |
Space group number | 2 |
Hermann-Mauguin space group symbol | P -1 |
Hall space group symbol | -P 1 |
Residual factor for all reflections | 0.0572 |
Residual factor for significantly intense reflections | 0.0499 |
Weighted residual factors for significantly intense reflections | 0.1096 |
Weighted residual factors for all reflections included in the refinement | 0.1148 |
Goodness-of-fit parameter for all reflections included in the refinement | 1.158 |
Diffraction radiation probe | x-ray |
Diffraction radiation wavelength | 1.34139 Å |
Diffraction radiation type | GaKα |