Information card for entry 7049700
Formula | C12 H22 Mn0.32 N14 Ni1.68 O16 |
Calculated formula | C12 H22 Mn0.33 N14 Ni1.67 O16 |
Title of publication | Syntheses of mono and bimetallic cyamelurate polymers with reversible chromic behaviour. |
Authors of publication | Mohan, Midhun; Rajak, Sanil; Tremblay, Alexandre A.; Maris, Thierry; Duong, Adam |
Journal of publication | Dalton transactions (Cambridge, England : 2003) |
Year of publication | 2019 |
Journal volume | 48 |
Journal issue | 20 |
Pages of publication | 7006 - 7014 |
a | 7.308 ± 0.0016 Å |
b | 8.6517 ± 0.0018 Å |
c | 9.4153 ± 0.0018 Å |
α | 78.474 ± 0.015° |
β | 83.477 ± 0.014° |
γ | 87.509 ± 0.015° |
Cell volume | 579.4 ± 0.2 Å3 |
Cell temperature | 100 K |
Ambient diffraction temperature | 100 K |
Number of distinct elements | 6 |
Space group number | 2 |
Hermann-Mauguin space group symbol | P -1 |
Hall space group symbol | -P 1 |
Residual factor for all reflections | 0.1137 |
Residual factor for significantly intense reflections | 0.0889 |
Weighted residual factors for significantly intense reflections | 0.2235 |
Weighted residual factors for all reflections included in the refinement | 0.2462 |
Goodness-of-fit parameter for all reflections included in the refinement | 1.06 |
Diffraction radiation probe | x-ray |
Diffraction radiation wavelength | 1.34139 Å |
Diffraction radiation type | GaKα |