Information card for entry 7049711
Formula | C19 H22 Cd N4 O4 |
Calculated formula | C19 H22 Cd N4 O4 |
Title of publication | Cd(ii) coordination polymers constructed from bis(pyridyl) ligands with an asymmetric spacer in chelating mode and diverse organic dicarboxylates: syntheses, structural evolutions and properties. |
Authors of publication | Zhu, Li-Na; Deng, Zhao-Peng; Ng, Seik Weng; Huo, Li-Hua; Gao, Shan |
Journal of publication | Dalton transactions (Cambridge, England : 2003) |
Year of publication | 2019 |
Journal volume | 48 |
Journal issue | 22 |
Pages of publication | 7589 - 7601 |
a | 22.6437 ± 0.0018 Å |
b | 10.0956 ± 0.0013 Å |
c | 25.971 ± 0.002 Å |
α | 90° |
β | 103.606 ± 0.008° |
γ | 90° |
Cell volume | 5770.4 ± 1 Å3 |
Cell temperature | 295 ± 2 K |
Ambient diffraction temperature | 295 ± 2 K |
Number of distinct elements | 5 |
Space group number | 15 |
Hermann-Mauguin space group symbol | C 1 2/c 1 |
Hall space group symbol | -C 2yc |
Residual factor for all reflections | 0.0734 |
Residual factor for significantly intense reflections | 0.044 |
Weighted residual factors for significantly intense reflections | 0.1008 |
Weighted residual factors for all reflections included in the refinement | 0.1167 |
Goodness-of-fit parameter for all reflections included in the refinement | 1.026 |
Diffraction radiation wavelength | 0.71073 Å |
Diffraction radiation type | MoKα |