Information card for entry 7049715
Formula | C38 H44 Cd2 Cl2 N8 O4 |
Calculated formula | C38 H44 Cd2 Cl2 N8 O4 |
Title of publication | Cd(ii) coordination polymers constructed from bis(pyridyl) ligands with an asymmetric spacer in chelating mode and diverse organic dicarboxylates: syntheses, structural evolutions and properties. |
Authors of publication | Zhu, Li-Na; Deng, Zhao-Peng; Ng, Seik Weng; Huo, Li-Hua; Gao, Shan |
Journal of publication | Dalton transactions (Cambridge, England : 2003) |
Year of publication | 2019 |
Journal volume | 48 |
Journal issue | 22 |
Pages of publication | 7589 - 7601 |
a | 13.3805 ± 0.0005 Å |
b | 14.9945 ± 0.0007 Å |
c | 10.0968 ± 0.0004 Å |
α | 90° |
β | 96.126 ± 0.005° |
γ | 90° |
Cell volume | 2014.19 ± 0.15 Å3 |
Cell temperature | 295 ± 2 K |
Ambient diffraction temperature | 295 ± 2 K |
Number of distinct elements | 6 |
Space group number | 14 |
Hermann-Mauguin space group symbol | P 1 21/c 1 |
Hall space group symbol | -P 2ybc |
Residual factor for all reflections | 0.0724 |
Residual factor for significantly intense reflections | 0.0484 |
Weighted residual factors for significantly intense reflections | 0.1024 |
Weighted residual factors for all reflections included in the refinement | 0.1149 |
Goodness-of-fit parameter for all reflections included in the refinement | 1.093 |
Diffraction radiation wavelength | 0.71073 Å |
Diffraction radiation type | MoKα |