Information card for entry 7049765
Formula | C36 H61 N2 O2 Sc Si2 |
Calculated formula | C36 H61 N2 O2 Sc Si2 |
Title of publication | Highly active rare-earth metal catalysts for heteroselective ring-opening polymerization of racemic lactide. |
Authors of publication | Pan, Yu; Li, Wenqiang; Wei, Ning-Ning; So, Yat-Ming; Lai, Xiaoling; Li, Yang; Jiang, Kang; He, Gaohong |
Journal of publication | Dalton transactions (Cambridge, England : 2003) |
Year of publication | 2019 |
Journal volume | 48 |
Journal issue | 25 |
Pages of publication | 9079 - 9088 |
a | 10.8715 ± 0.0004 Å |
b | 17.0073 ± 0.0006 Å |
c | 11.2197 ± 0.0004 Å |
α | 90° |
β | 110.818 ± 0.001° |
γ | 90° |
Cell volume | 1939.03 ± 0.12 Å3 |
Cell temperature | 150 ± 2 K |
Ambient diffraction temperature | 150 ± 2 K |
Number of distinct elements | 6 |
Space group number | 4 |
Hermann-Mauguin space group symbol | P 1 21 1 |
Hall space group symbol | P 2yb |
Residual factor for all reflections | 0.0242 |
Residual factor for significantly intense reflections | 0.0234 |
Weighted residual factors for significantly intense reflections | 0.0618 |
Weighted residual factors for all reflections included in the refinement | 0.0622 |
Goodness-of-fit parameter for all reflections included in the refinement | 1.097 |
Diffraction radiation wavelength | 0.71073 Å |
Diffraction radiation type | MoKα |