Information card for entry 7049771
Formula | C58 H55 F12 N9 P4 Ru2 |
Calculated formula | C58 H55 F12 N9 P4 Ru2 |
Title of publication | Influence of ligand substitution at the donor and acceptor center on MMCT in a cyanide-bridged mixed-valence system. |
Authors of publication | Zhang, Lin-Tao; Zhu, Xiao-Quan; Hu, Sheng-Min; Zhang, Yu-Xiao; Su, Shao-Dong; Yang, Yu-Ying; Wu, Xin-Tao; Sheng, Tian-Lu |
Journal of publication | Dalton transactions (Cambridge, England : 2003) |
Year of publication | 2019 |
Journal volume | 48 |
Journal issue | 22 |
Pages of publication | 7809 - 7816 |
a | 12.637 ± 0.008 Å |
b | 26.812 ± 0.015 Å |
c | 19.841 ± 0.013 Å |
α | 90° |
β | 100.182 ± 0.009° |
γ | 90° |
Cell volume | 6617 ± 7 Å3 |
Cell temperature | 293 ± 2 K |
Ambient diffraction temperature | 293 ± 2 K |
Number of distinct elements | 6 |
Space group number | 14 |
Hermann-Mauguin space group symbol | P 1 21/n 1 |
Hall space group symbol | -P 2yn |
Residual factor for all reflections | 0.1021 |
Residual factor for significantly intense reflections | 0.0866 |
Weighted residual factors for significantly intense reflections | 0.2449 |
Weighted residual factors for all reflections included in the refinement | 0.2699 |
Goodness-of-fit parameter for all reflections included in the refinement | 1.094 |
Diffraction radiation wavelength | 0.71073 Å |
Diffraction radiation type | MoKα |