Information card for entry 7049781
Formula | C31 H24 Br Cl3 Ir N5 |
Calculated formula | C31 H24 Br Cl3 Ir N5 |
Title of publication | Cleavage of acyclic diaminocarbene ligands at an iridium(iii) center. Recognition of a new reactivity mode for carbene ligands. |
Authors of publication | Kinzhalov, Mikhail A.; Eremina, Anzhelika A.; Smirnov, Andrey S.; Suslonov, Vitalii V.; Kukushkin, Vadim Yu; Luzyanin, Konstantin V. |
Journal of publication | Dalton transactions (Cambridge, England : 2003) |
Year of publication | 2019 |
Journal volume | 48 |
Journal issue | 22 |
Pages of publication | 7571 - 7582 |
a | 14.0167 ± 0.0003 Å |
b | 12.4881 ± 0.0002 Å |
c | 19.1229 ± 0.0003 Å |
α | 90° |
β | 105.766 ± 0.0019° |
γ | 90° |
Cell volume | 3221.38 ± 0.1 Å3 |
Cell temperature | 100 ± 2 K |
Ambient diffraction temperature | 100 ± 2 K |
Number of distinct elements | 6 |
Space group number | 14 |
Hermann-Mauguin space group symbol | P 1 21/c 1 |
Hall space group symbol | -P 2ybc |
Residual factor for all reflections | 0.0601 |
Residual factor for significantly intense reflections | 0.0514 |
Weighted residual factors for significantly intense reflections | 0.1331 |
Weighted residual factors for all reflections included in the refinement | 0.1427 |
Goodness-of-fit parameter for all reflections included in the refinement | 1.03 |
Diffraction radiation probe | x-ray |
Diffraction radiation wavelength | 1.54184 Å |
Diffraction radiation type | CuKα |