Information card for entry 7049822
Formula | C180 H168 Co2 K2 N18 O6 P12 Se12 |
Calculated formula | C180 H168 Co2 K2 N18 O6 P12 Se12 |
Title of publication | Metal-directed self-assembly of transition metal heterometallascorpionates. |
Authors of publication | Pastor-Medrano, Jesús; Rodríguez-Raya, Francisco R; Bernabé-Pablo, Erandi; Mireles-Chávez, Daniel A; Jancik, Vojtech; Martínez-Otero, Diego; Moya-Cabrera, Mónica |
Journal of publication | Dalton transactions (Cambridge, England : 2003) |
Year of publication | 2019 |
Journal volume | 48 |
Journal issue | 19 |
Pages of publication | 6571 - 6580 |
a | 16.1262 ± 0.0006 Å |
b | 16.3809 ± 0.0006 Å |
c | 20.5889 ± 0.0007 Å |
α | 67.647 ± 0.001° |
β | 89.772 ± 0.001° |
γ | 62.696 ± 0.001° |
Cell volume | 4372.5 ± 0.3 Å3 |
Cell temperature | 100 ± 2 K |
Ambient diffraction temperature | 100 ± 2 K |
Number of distinct elements | 8 |
Space group number | 2 |
Hermann-Mauguin space group symbol | P -1 |
Hall space group symbol | -P 1 |
Residual factor for all reflections | 0.0588 |
Residual factor for significantly intense reflections | 0.0399 |
Weighted residual factors for significantly intense reflections | 0.0817 |
Weighted residual factors for all reflections included in the refinement | 0.088 |
Goodness-of-fit parameter for all reflections included in the refinement | 1.02 |
Diffraction radiation wavelength | 0.71073 Å |
Diffraction radiation type | MoKα |