Information card for entry 7049826
Formula | C180 H168 Co2 K2 N18 O6 P12 S12 |
Calculated formula | C180 H168 Co2 K2 N18 O6 P12 S12 |
Title of publication | Metal-directed self-assembly of transition metal heterometallascorpionates. |
Authors of publication | Pastor-Medrano, Jesús; Rodríguez-Raya, Francisco R; Bernabé-Pablo, Erandi; Mireles-Chávez, Daniel A; Jancik, Vojtech; Martínez-Otero, Diego; Moya-Cabrera, Mónica |
Journal of publication | Dalton transactions (Cambridge, England : 2003) |
Year of publication | 2019 |
Journal volume | 48 |
Journal issue | 19 |
Pages of publication | 6571 - 6580 |
a | 16.0185 ± 0.0016 Å |
b | 16.1962 ± 0.0016 Å |
c | 20.537 ± 0.002 Å |
α | 67.0861 ± 0.0016° |
β | 89.5626 ± 0.0018° |
γ | 63.0038 ± 0.0016° |
Cell volume | 4279.1 ± 0.7 Å3 |
Cell temperature | 100 ± 2 K |
Ambient diffraction temperature | 100 ± 2 K |
Number of distinct elements | 8 |
Space group number | 2 |
Hermann-Mauguin space group symbol | P -1 |
Hall space group symbol | -P 1 |
Residual factor for all reflections | 0.0596 |
Residual factor for significantly intense reflections | 0.0545 |
Weighted residual factors for significantly intense reflections | 0.1324 |
Weighted residual factors for all reflections included in the refinement | 0.1356 |
Goodness-of-fit parameter for all reflections included in the refinement | 1.092 |
Diffraction radiation wavelength | 0.71073 Å |
Diffraction radiation type | MoKα |