Information card for entry 7049843
Formula | C9 H28.75 Co F3 N3 O4 |
Calculated formula | C9 H28.75 Co F3 N3 O4 |
Title of publication | Exploring transition metal fluoride chelates - synthesis, properties and prospects towards potential PET probes. |
Authors of publication | Blower, Philip J.; Levason, William; Luthra, Sajinder K.; McRobbie, Graeme; Monzittu, Francesco M.; Mules, Thomas O.; Reid, Gillian; Subhan, M. Nadeem |
Journal of publication | Dalton transactions (Cambridge, England : 2003) |
Year of publication | 2019 |
Journal volume | 48 |
Journal issue | 20 |
Pages of publication | 6767 - 6776 |
a | 8.74923 ± 0.00007 Å |
b | 13.14407 ± 0.00011 Å |
c | 26.2569 ± 0.0003 Å |
α | 90° |
β | 90° |
γ | 90° |
Cell volume | 3019.56 ± 0.05 Å3 |
Cell temperature | 100 ± 0.1 K |
Ambient diffraction temperature | 100 ± 0.1 K |
Number of distinct elements | 6 |
Space group number | 61 |
Hermann-Mauguin space group symbol | P b c a |
Hall space group symbol | -P 2ac 2ab |
Residual factor for all reflections | 0.0586 |
Residual factor for significantly intense reflections | 0.0586 |
Weighted residual factors for significantly intense reflections | 0.1427 |
Weighted residual factors for all reflections included in the refinement | 0.1427 |
Goodness-of-fit parameter for all reflections included in the refinement | 1.38 |
Diffraction radiation probe | x-ray |
Diffraction radiation wavelength | 0.71075 Å |
Diffraction radiation type | MoKα |