Information card for entry 7049852
Chemical name | [PDINd(THF)]2 |
Formula | C66 H88 N6 Nd2 O3 |
Calculated formula | C66 H88 N6 Nd2 O3 |
Title of publication | A reduction series of neodymium supported by pyridine(diimine) ligands. |
Authors of publication | Galley, Shane S.; Pattenaude, Scott A.; Higgins, Robert F.; Tatebe, Caleb J.; Stanley, Dalton A.; Fanwick, Phillip E.; Zeller, Matthias; Schelter, Eric J.; Bart, Suzanne C. |
Journal of publication | Dalton transactions (Cambridge, England : 2003) |
Year of publication | 2019 |
Journal volume | 48 |
Journal issue | 23 |
Pages of publication | 8021 - 8025 |
a | 11.2456 ± 0.0005 Å |
b | 15.8225 ± 0.0009 Å |
c | 16.9949 ± 0.0007 Å |
α | 90° |
β | 93.319 ± 0.003° |
γ | 90° |
Cell volume | 3018.9 ± 0.3 Å3 |
Cell temperature | 100 ± 2 K |
Ambient diffraction temperature | 100 ± 2 K |
Number of distinct elements | 5 |
Space group number | 14 |
Hermann-Mauguin space group symbol | P 1 21/c 1 |
Hall space group symbol | -P 2ybc |
Residual factor for all reflections | 0.084 |
Residual factor for significantly intense reflections | 0.0572 |
Weighted residual factors for significantly intense reflections | 0.1239 |
Weighted residual factors for all reflections included in the refinement | 0.1422 |
Goodness-of-fit parameter for all reflections included in the refinement | 1.096 |
Diffraction radiation wavelength | 1.54178 Å |
Diffraction radiation type | CuKα |