Information card for entry 7049864
Formula | C36 H36 F20 Mg2 N4 Si4 |
Calculated formula | C36 H36 F20 Mg2 N4 Si4 |
Title of publication | Lewis acidic alkaline earth metal complexes with a perfluorinated diphenylamide ligand. |
Authors of publication | Fischer, Christian A.; Rösch, Andreas; Elsen, Holger; Ballmann, Gerd; Wiesinger, Michael; Langer, Jens; Färber, Christian; Harder, Sjoerd |
Journal of publication | Dalton transactions (Cambridge, England : 2003) |
Year of publication | 2019 |
Journal volume | 48 |
Journal issue | 20 |
Pages of publication | 6757 - 6766 |
a | 11.7023 ± 0.0003 Å |
b | 15.6263 ± 0.0003 Å |
c | 13.0643 ± 0.0003 Å |
α | 90° |
β | 111.787 ± 0.003° |
γ | 90° |
Cell volume | 2218.34 ± 0.1 Å3 |
Cell temperature | 100 K |
Ambient diffraction temperature | 100 K |
Number of distinct elements | 6 |
Space group number | 14 |
Hermann-Mauguin space group symbol | P 1 21/n 1 |
Hall space group symbol | -P 2yn |
Residual factor for all reflections | 0.0416 |
Residual factor for significantly intense reflections | 0.0366 |
Weighted residual factors for significantly intense reflections | 0.1001 |
Weighted residual factors for all reflections included in the refinement | 0.1052 |
Goodness-of-fit parameter for all reflections included in the refinement | 1.038 |
Diffraction radiation probe | x-ray |
Diffraction radiation wavelength | 1.54184 Å |
Diffraction radiation type | CuKα |