Information card for entry 7049877
Formula | C12 H30 I3 O3 Tb |
Calculated formula | C12 H30 I3 O3 Tb |
Title of publication | Diethyl ether adducts of trivalent lanthanide iodides. |
Authors of publication | Gompa, Thaige P.; Rice, Natalie T.; Russo, Dominic R.; Aguirre Quintana, Luis M.; Yik, Brandon J.; Bacsa, John; La Pierre, Henry S. |
Journal of publication | Dalton transactions (Cambridge, England : 2003) |
Year of publication | 2019 |
Journal volume | 48 |
Journal issue | 23 |
Pages of publication | 8030 - 8033 |
a | 10.0273 ± 0.0006 Å |
b | 13.7816 ± 0.0009 Å |
c | 15.791 ± 0.0011 Å |
α | 90° |
β | 90° |
γ | 90° |
Cell volume | 2182.2 ± 0.2 Å3 |
Cell temperature | 100 ± 2 K |
Ambient diffraction temperature | 100 ± 2 K |
Number of distinct elements | 5 |
Space group number | 60 |
Hermann-Mauguin space group symbol | P b c n |
Hall space group symbol | -P 2n 2ab |
Residual factor for all reflections | 0.028 |
Residual factor for significantly intense reflections | 0.0235 |
Weighted residual factors for significantly intense reflections | 0.0553 |
Weighted residual factors for all reflections included in the refinement | 0.0571 |
Goodness-of-fit parameter for all reflections included in the refinement | 1.073 |
Diffraction radiation wavelength | 0.71073 Å |
Diffraction radiation type | MoKα |