Information card for entry 7049882
Formula | C12 H30 I3 O3 Pr |
Calculated formula | C12 H30 I3 O3 Pr |
Title of publication | Diethyl ether adducts of trivalent lanthanide iodides. |
Authors of publication | Gompa, Thaige P.; Rice, Natalie T.; Russo, Dominic R.; Aguirre Quintana, Luis M.; Yik, Brandon J.; Bacsa, John; La Pierre, Henry S. |
Journal of publication | Dalton transactions (Cambridge, England : 2003) |
Year of publication | 2019 |
Journal volume | 48 |
Journal issue | 23 |
Pages of publication | 8030 - 8033 |
a | 10.1152 ± 0.0004 Å |
b | 13.9216 ± 0.0007 Å |
c | 15.8716 ± 0.0008 Å |
α | 90° |
β | 90° |
γ | 90° |
Cell volume | 2235.04 ± 0.18 Å3 |
Cell temperature | 100 ± 2 K |
Ambient diffraction temperature | 100 ± 2 K |
Number of distinct elements | 5 |
Space group number | 60 |
Hermann-Mauguin space group symbol | P b c n |
Hall space group symbol | -P 2n 2ab |
Residual factor for all reflections | 0.0369 |
Residual factor for significantly intense reflections | 0.0255 |
Weighted residual factors for significantly intense reflections | 0.0653 |
Weighted residual factors for all reflections included in the refinement | 0.0747 |
Goodness-of-fit parameter for all reflections included in the refinement | 1.09 |
Diffraction radiation wavelength | 0.71073 Å |
Diffraction radiation type | MoKα |