Information card for entry 7049960
Formula | C34 H28 F3 Mo N3 O7 S |
Calculated formula | C34 H28 F3 Mo N3 O7 S |
Title of publication | Molybdenum(ii) complexes with p-substituted BIAN ligands: synthesis, characterization, biological activity and computational study. |
Authors of publication | Quintal, Susana; Pires da Silva, Maria João; Martins, Soraia R. M.; Sales, Rita; Félix, Vítor; Drew, Michael G. B.; Meireles, Margarida; Mourato, Ana C.; Nunes, Carla D.; Saraiva, Marta S.; Machuqueiro, Miguel; Calhorda, Maria José |
Journal of publication | Dalton transactions (Cambridge, England : 2003) |
Year of publication | 2019 |
Journal volume | 48 |
Journal issue | 23 |
Pages of publication | 8449 - 8463 |
a | 9.9182 ± 0.0006 Å |
b | 13.4256 ± 0.0008 Å |
c | 14.5907 ± 0.0008 Å |
α | 66.621 ± 0.006° |
β | 71.534 ± 0.005° |
γ | 72.517 ± 0.005° |
Cell volume | 1657.12 ± 0.19 Å3 |
Cell temperature | 293 ± 2 K |
Ambient diffraction temperature | 293 ± 2 K |
Number of distinct elements | 7 |
Space group number | 2 |
Hermann-Mauguin space group symbol | P -1 |
Hall space group symbol | -P 1 |
Residual factor for all reflections | 0.0278 |
Residual factor for significantly intense reflections | 0.0248 |
Weighted residual factors for significantly intense reflections | 0.0605 |
Weighted residual factors for all reflections included in the refinement | 0.0616 |
Goodness-of-fit parameter for all reflections included in the refinement | 1.06 |
Diffraction radiation wavelength | 0.71073 Å |
Diffraction radiation type | MoKα |