Information card for entry 7049985
Formula | C30 H33 Fe N9 O10 S2 |
Calculated formula | C30 H33 Fe N9 O10 S2 |
Title of publication | Spin crossover in hydrogen-bonded frameworks of Fe<sup>II</sup> complexes with organodisulfonate anions. |
Authors of publication | Shen, Fu-Xing; Pi, Qian; Shi, Le; Shao, Dong; Li, Hong-Qing; Sun, Yu-Chen; Wang, Xin-Yi |
Journal of publication | Dalton transactions (Cambridge, England : 2003) |
Year of publication | 2019 |
Journal volume | 48 |
Journal issue | 24 |
Pages of publication | 8815 - 8825 |
a | 10.2373 ± 0.0007 Å |
b | 10.3544 ± 0.0007 Å |
c | 16.2287 ± 0.0011 Å |
α | 103.854 ± 0.002° |
β | 92.541 ± 0.002° |
γ | 93.254 ± 0.002° |
Cell volume | 1664.5 ± 0.2 Å3 |
Cell temperature | 123 ± 2 K |
Ambient diffraction temperature | 123 ± 2 K |
Number of distinct elements | 6 |
Space group number | 2 |
Hermann-Mauguin space group symbol | P -1 |
Hall space group symbol | -P 1 |
Residual factor for all reflections | 0.0704 |
Residual factor for significantly intense reflections | 0.0603 |
Weighted residual factors for significantly intense reflections | 0.1594 |
Weighted residual factors for all reflections included in the refinement | 0.1678 |
Goodness-of-fit parameter for all reflections included in the refinement | 1.05 |
Diffraction radiation wavelength | 0.71073 Å |
Diffraction radiation type | MoKα |