Information card for entry 7052159
Common name | 9 |
Formula | C18 H22 Cl4 Cu N4 |
Calculated formula | C18 H22 Cl4 Cu N4 |
Title of publication | The solvent-templating effect as the driving factor that influences the formation of crystalline materials based on the stacking of metallocycles |
Authors of publication | Liliana Dobrzańska; Gareth O. Lloyd; Leonard J. Barbour |
Journal of publication | New Journal of Chemistry |
Year of publication | 2007 |
Journal volume | 31 |
Journal issue | 5 |
Pages of publication | 669 |
a | 8.539 ± 0.005 Å |
b | 10.673 ± 0.006 Å |
c | 13.386 ± 0.007 Å |
α | 104.272 ± 0.01° |
β | 91.858 ± 0.01° |
γ | 112.793 ± 0.009° |
Cell volume | 1078.7 ± 1 Å3 |
Cell temperature | 100 ± 2 K |
Ambient diffraction temperature | 100 ± 2 K |
Number of distinct elements | 5 |
Space group number | 2 |
Hermann-Mauguin space group symbol | P -1 |
Hall space group symbol | -P 1 |
Residual factor for all reflections | 0.1259 |
Residual factor for significantly intense reflections | 0.0731 |
Weighted residual factors for significantly intense reflections | 0.142 |
Weighted residual factors for all reflections included in the refinement | 0.1655 |
Goodness-of-fit parameter for all reflections included in the refinement | 0.959 |
Diffraction radiation wavelength | 0.71073 Å |
Diffraction radiation type | MoKα |