Information card for entry 7052438
Formula | C20 H32 Cr2 Mn N12 O8 |
Calculated formula | C20 H16 Cr2 Mn N12 O8 |
Title of publication | [CrIII(L)(CN)4]-: a new building block in designing cyanide-bridged 4,2-ribbon-like chains {[CrIII(L)(CN)4]2Mn(H2O)2}·nH2O [L = 2-aminomethylpyridine (n = 6) and 1,10-phenanthroline (n = 4)] |
Authors of publication | Luminita Toma; Rodrigue Lescouëzec; Jacqueline Vaissermann; Patrick Herson; Valérie Marvaud; Francesc Lloret; Miguel Julve |
Journal of publication | New Journal of Chemistry |
Year of publication | 2005 |
Journal volume | 29 |
Journal issue | 1 |
Pages of publication | 210 |
a | 7.191 ± 0.005 Å |
b | 10.566 ± 0.007 Å |
c | 11.906 ± 0.005 Å |
α | 101.66 ± 0.04° |
β | 107.08 ± 0.04° |
γ | 96.72 ± 0.05° |
Cell volume | 831.7 ± 0.9 Å3 |
Cell temperature | 295 K |
Ambient diffraction temperature | 295 K |
Number of distinct elements | 6 |
Space group number | 2 |
Hermann-Mauguin space group symbol | P -1 |
Hall space group symbol | -P 1 |
Residual factor for all reflections | 0.063 |
Residual factor for significantly intense reflections | 0.0599 |
Weighted residual factors for all reflections | 0.0632 |
Weighted residual factors for significantly intense reflections | 0.0618 |
Weighted residual factors for all reflections included in the refinement | 0.0618 |
Goodness-of-fit parameter for all reflections included in the refinement | 1.0327 |
Diffraction radiation wavelength | 0.71073 Å |
Diffraction radiation type | MoKα |