Information card for entry 7052814
Formula | C33 H49 N2 O2 P2 Rh |
Calculated formula | C33 H49 N2 O2 P2 Rh |
SMILES | C(C)(C)(C)[P]1(C(C)(C)C)Oc2c(c3ccccc3)nc(c3ccccc3)c3[n]2[Rh]1(C)[P](C(C)(C)C)(C(C)(C)C)O3 |
Title of publication | The quest for stable σ-methane complexes: computational and experimental studies |
Authors of publication | Walter, Marc D.; White, Peter S.; Schauer, Cynthia K.; Brookhart, Maurice |
Journal of publication | New Journal of Chemistry |
Year of publication | 2011 |
Journal volume | 35 |
Journal issue | 12 |
Pages of publication | 2884 |
a | 11.1771 ± 0.0002 Å |
b | 12.8681 ± 0.0003 Å |
c | 23.2854 ± 0.0005 Å |
α | 90° |
β | 94.739 ± 0.001° |
γ | 90° |
Cell volume | 3337.64 ± 0.12 Å3 |
Cell temperature | 100 ± 2 K |
Ambient diffraction temperature | 100 ± 2 K |
Number of distinct elements | 6 |
Space group number | 14 |
Hermann-Mauguin space group symbol | P 1 21/c 1 |
Hall space group symbol | -P 2ybc |
Residual factor for all reflections | 0.0244 |
Residual factor for significantly intense reflections | 0.0232 |
Weighted residual factors for significantly intense reflections | 0.0604 |
Weighted residual factors for all reflections included in the refinement | 0.0613 |
Goodness-of-fit parameter for all reflections included in the refinement | 1.065 |
Diffraction radiation wavelength | 1.54178 Å |
Diffraction radiation type | CuKα |