Information card for entry 7053200
Formula | C24 H49 Mo8 N7 O26 |
Calculated formula | C24 H49 Mo8 N7 O26 |
Title of publication | New polyoxomolybdate compounds synthesized in situ using ionic liquid 1-butyl-3-methyl-imidazolium tetrafluoroborate as green solvent |
Authors of publication | Linguito, Stephen L.; Zhang, Xiao; Padmanabhan, Moothetty; Biradar, Ankush V.; Xu, Taotao; Emge, Thomas J.; Asefa, Tewodros; Li, Jing |
Journal of publication | New Journal of Chemistry |
Year of publication | 2013 |
Journal volume | 37 |
Journal issue | 9 |
Pages of publication | 2894 |
a | 9.9473 ± 0.0005 Å |
b | 12.27 ± 0.0008 Å |
c | 21.0254 ± 0.001 Å |
α | 76.7 ± 0.001° |
β | 79.222 ± 0.001° |
γ | 66.301 ± 0.001° |
Cell volume | 2273.9 ± 0.2 Å3 |
Cell temperature | 100 ± 2 K |
Ambient diffraction temperature | 100 ± 2 K |
Number of distinct elements | 5 |
Space group number | 2 |
Hermann-Mauguin space group symbol | P -1 |
Hall space group symbol | -P 1 |
Residual factor for all reflections | 0.0531 |
Residual factor for significantly intense reflections | 0.0372 |
Weighted residual factors for significantly intense reflections | 0.0662 |
Weighted residual factors for all reflections included in the refinement | 0.0711 |
Goodness-of-fit parameter for all reflections included in the refinement | 1.007 |
Diffraction radiation wavelength | 0.71073 Å |
Diffraction radiation type | MoKα |