Information card for entry 7053212
Formula | C12 H12 N2 O2 |
Calculated formula | C12 H12 N2 O2 |
Title of publication | 2,2′-Bipyridine Zn(ii) complexes: effect of the 4,4′ substituents on the crystalline solid state properties |
Authors of publication | Yadav, Yogesh J.; Mastropietro, Teresa F.; Szerb, Elisabeta Ildyko; Talarico, Anna Maria; Pirillo, Sante; Pucci, Daniela; Crispini, Alessandra; Ghedini, Mauro |
Journal of publication | New Journal of Chemistry |
Year of publication | 2013 |
Journal volume | 37 |
Journal issue | 5 |
Pages of publication | 1486 |
a | 7.507 ± 0.005 Å |
b | 12.063 ± 0.008 Å |
c | 16.97 ± 0.011 Å |
α | 90° |
β | 96.79 ± 0.02° |
γ | 90° |
Cell volume | 1526 ± 1.7 Å3 |
Cell temperature | 296 ± 2 K |
Ambient diffraction temperature | 296 ± 2 K |
Number of distinct elements | 4 |
Space group number | 14 |
Hermann-Mauguin space group symbol | P 1 21/c 1 |
Hall space group symbol | -P 2ybc |
Residual factor for all reflections | 0.0774 |
Residual factor for significantly intense reflections | 0.0485 |
Weighted residual factors for significantly intense reflections | 0.1244 |
Weighted residual factors for all reflections included in the refinement | 0.1437 |
Goodness-of-fit parameter for all reflections included in the refinement | 1.024 |
Diffraction radiation wavelength | 0.71073 Å |
Diffraction radiation type | MoKα |