Information card for entry 7053827
Common name | dibenzoylmethane |
Chemical name | dibenzoylmethane |
Formula | C15 H12 O2 |
Calculated formula | C15 H12 O2 |
SMILES | c1(ccccc1)C(=O)/C=C(/c1ccccc1)O |
Title of publication | Hydrogen atom behaviour imaged in a short intramolecular hydrogen bond using the combined approach of X-ray and neutron diffraction |
Authors of publication | Thomas, Lynne H.; Florence, Alastair J.; Wilson, Chick C. |
Journal of publication | New Journal of Chemistry |
Year of publication | 2009 |
Journal volume | 33 |
Journal issue | 12 |
Pages of publication | 2486 |
a | 8.7652 ± 0.0008 Å |
b | 10.8627 ± 0.0009 Å |
c | 24.513 ± 0.002 Å |
α | 90° |
β | 90° |
γ | 90° |
Cell volume | 2334 ± 0.3 Å3 |
Cell temperature | 280 ± 2 K |
Ambient diffraction temperature | 280 ± 2 K |
Number of distinct elements | 3 |
Space group number | 61 |
Hermann-Mauguin space group symbol | P b c a |
Hall space group symbol | -P 2ac 2ab |
Residual factor for all reflections | 0.067 |
Residual factor for significantly intense reflections | 0.067 |
Weighted residual factors for significantly intense reflections | 0.1284 |
Weighted residual factors for all reflections included in the refinement | 0.1284 |
Goodness-of-fit parameter for all reflections included in the refinement | 1.318 |
Diffraction radiation probe | neutron |
Diffraction radiation type | neutron |