Information card for entry 7054114
Formula | Mo3 O12 Y2 |
Calculated formula | Mo3 O12 Y2 |
Title of publication | Yttrium(iii) oxomolybdates(vi) as potential host materials for luminescence applications: an investigation of Eu3±doped Y2[MoO4]3 and Y2[MoO4]2[Mo2O7] |
Authors of publication | Laufer, Sonja; Strobel, Sabine; Schleid, Thomas; Cybinska, Joanna; Mudring, Anja-Verena; Hartenbach, Ingo |
Journal of publication | New Journal of Chemistry |
Year of publication | 2013 |
Journal volume | 37 |
Journal issue | 7 |
Pages of publication | 1919 |
a | 7.2927 ± 0.0002 Å |
b | 7.2927 ± 0.0002 Å |
c | 10.5726 ± 0.0003 Å |
α | 90° |
β | 90° |
γ | 90° |
Cell volume | 562.29 ± 0.03 Å3 |
Cell temperature | 293 ± 2 K |
Ambient diffraction temperature | 293 ± 2 K |
Number of distinct elements | 3 |
Space group number | 113 |
Hermann-Mauguin space group symbol | P -4 21 m |
Hall space group symbol | P -4 2ab |
Residual factor for all reflections | 0.0252 |
Residual factor for significantly intense reflections | 0.0221 |
Weighted residual factors for significantly intense reflections | 0.0431 |
Weighted residual factors for all reflections included in the refinement | 0.0439 |
Goodness-of-fit parameter for all reflections included in the refinement | 1.058 |
Diffraction radiation wavelength | 0.71073 Å |
Diffraction radiation type | MoKα |