Information card for entry 7054125
Common name | 3-bromo-lawsone oxime |
Formula | C10 H6 Br N O3.63 |
Calculated formula | C10 H6 Br N O3.625 |
Title of publication | Antioxidant and anticancer activities of supramolecularly controlled magnetostructural halo-oximes of lawsone |
Authors of publication | Zaware, Santosh B.; Gonnade, Rajesh G.; Srinivas, Darbha; Khan, Ayesha; Rane, Sandhya Y. |
Journal of publication | New Journal of Chemistry |
Year of publication | 2011 |
Journal volume | 35 |
Journal issue | 8 |
Pages of publication | 1615 |
a | 21.092 ± 0.006 Å |
b | 20.588 ± 0.006 Å |
c | 4.6388 ± 0.0013 Å |
α | 90° |
β | 90° |
γ | 90° |
Cell volume | 2014.4 ± 1 Å3 |
Cell temperature | 297 ± 2 K |
Ambient diffraction temperature | 297 ± 2 K |
Number of distinct elements | 5 |
Space group number | 33 |
Hermann-Mauguin space group symbol | P n a 21 |
Hall space group symbol | P 2c -2n |
Residual factor for all reflections | 0.0543 |
Residual factor for significantly intense reflections | 0.0425 |
Weighted residual factors for significantly intense reflections | 0.0962 |
Weighted residual factors for all reflections included in the refinement | 0.1019 |
Goodness-of-fit parameter for all reflections included in the refinement | 1.04 |
Diffraction radiation wavelength | 0.71073 Å |
Diffraction radiation type | MoKα |