Information card for entry 7054398
Formula | C12 H14 N2 O3 S |
Calculated formula | C12 H14 N2 O3 S |
SMILES | S=C1NC=CN1c1cc(OC)c(OC)c(OC)c1 |
Title of publication | Synthesis and Structural Characterization of 1-Arylimidazole-2-thiones and N,N'-Aryldiethoxyethylthioureas with Electronically Diverse Substituents: A Manifold of Hydrogen Bonding Networks. |
Authors of publication | Palmer, Joshua H.; Parkin, Gerard |
Journal of publication | New journal of chemistry = Nouveau journal de chimie |
Year of publication | 2014 |
Journal volume | 38 |
Journal issue | 9 |
Pages of publication | 4071 - 4082 |
a | 7.2383 ± 0.0006 Å |
b | 7.9459 ± 0.0007 Å |
c | 22.324 ± 0.002 Å |
α | 90° |
β | 93.075 ± 0.001° |
γ | 90° |
Cell volume | 1282.11 ± 0.19 Å3 |
Cell temperature | 150 ± 2 K |
Ambient diffraction temperature | 150 ± 2 K |
Number of distinct elements | 5 |
Space group number | 14 |
Hermann-Mauguin space group symbol | P 1 21/c 1 |
Hall space group symbol | -P 2ybc |
Residual factor for all reflections | 0.0745 |
Residual factor for significantly intense reflections | 0.0426 |
Weighted residual factors for significantly intense reflections | 0.0914 |
Weighted residual factors for all reflections included in the refinement | 0.1042 |
Goodness-of-fit parameter for all reflections included in the refinement | 1.049 |
Diffraction radiation wavelength | 0.71073 Å |
Diffraction radiation type | MoKα |
Duplicate of | 7054266 |