Information card for entry 7055416
Formula | C29 H53 Au2 Cl7 N6 |
Calculated formula | C29 H53 Au2 Cl7 N6 |
SMILES | [Au](Cl)[Cl-].[Au](Cl)[Cl-].N([C@H]1[C@H](Nc2n(c(c([n+]2C(C)C)C)C)C(C)C)CCCC1)c1n(c(c([n+]1C(C)C)C)C)C(C)C.C(Cl)(Cl)Cl |
Title of publication | Platinum(II) complexes with hybrid amine-imidazolin-2-imine ligands and their reactivity toward bio-molecules |
Authors of publication | Bogojeski, Jovana; Volbeda, Jeroen; Bugarcic, Zivadin D.; Freytag, Matthias; Tamm, Matthias |
Journal of publication | New J. Chem. |
Year of publication | 2016 |
a | 11.9748 ± 0.0003 Å |
b | 10.242 ± 0.0003 Å |
c | 16.6859 ± 0.0004 Å |
α | 90° |
β | 97.307 ± 0.003° |
γ | 90° |
Cell volume | 2029.84 ± 0.09 Å3 |
Cell temperature | 100 ± 2 K |
Ambient diffraction temperature | 100 ± 2 K |
Number of distinct elements | 5 |
Space group number | 4 |
Hermann-Mauguin space group symbol | P 1 21 1 |
Hall space group symbol | P 2yb |
Residual factor for all reflections | 0.0542 |
Residual factor for significantly intense reflections | 0.0365 |
Weighted residual factors for significantly intense reflections | 0.0722 |
Weighted residual factors for all reflections included in the refinement | 0.0789 |
Goodness-of-fit parameter for all reflections included in the refinement | 1.055 |
Diffraction radiation wavelength | 0.71073 Å |
Diffraction radiation type | MoKα |