Information card for entry 7055800
Formula | C15 H16 Cu N4 O6 |
Calculated formula | C15 H16 Cu N4 O6 |
Title of publication | Copper(ii) and iron(iii) complexes with arylhydrazone of ethyl 2-cyanoacetate or formazan ligands as catalysts for oxidation of alcohols |
Authors of publication | Martins, Nuno M. R.; Mahmudov, Kamran T.; Guedes da Silva, M. Fátima C.; Martins, Luísa M. D. R. S.; Pombeiro, Armando J. L. |
Journal of publication | New J. Chem. |
Year of publication | 2016 |
Journal volume | 40 |
Journal issue | 12 |
Pages of publication | 10071 |
a | 8.3116 ± 0.0005 Å |
b | 10.4327 ± 0.0008 Å |
c | 10.7676 ± 0.0008 Å |
α | 105.623 ± 0.004° |
β | 92.203 ± 0.004° |
γ | 109.315 ± 0.003° |
Cell volume | 840.18 ± 0.11 Å3 |
Cell temperature | 296 ± 2 K |
Ambient diffraction temperature | 296 ± 2 K |
Number of distinct elements | 5 |
Space group number | 2 |
Hermann-Mauguin space group symbol | P -1 |
Hall space group symbol | -P 1 |
Residual factor for all reflections | 0.0831 |
Residual factor for significantly intense reflections | 0.0494 |
Weighted residual factors for significantly intense reflections | 0.1026 |
Weighted residual factors for all reflections included in the refinement | 0.1194 |
Goodness-of-fit parameter for all reflections included in the refinement | 1.148 |
Diffraction radiation wavelength | 0.71073 Å |
Diffraction radiation type | MoKα |