Information card for entry 7055837
Chemical name | cis-hydroxodichlorodipyridinenitrosylruthenium |
Formula | C10 H11 Cl2 N3 O2 Ru |
Calculated formula | C10 H11 Cl2 N3 O2 Ru |
SMILES | [n]1(ccccc1)[Ru]([n]1ccccc1)(O)(N=O)(Cl)Cl |
Title of publication | Synthesis and crystal structure of nitrosoruthenium complexes cis-[Ru(NO)Py2Cl2(OH)] and cis-[Ru(NO)Py2Cl2(H2O)]Cl. Photoinduced transformations of cis-[Ru(NO)Py2Cl2(OH)] |
Authors of publication | Makhinya, Alexander N.; Il’in, Maxim A.; Yamaletdinov, Ruslan D.; Korolkov, Ilya V.; Baidina, Iraida A. |
Journal of publication | New J. Chem. |
Year of publication | 2016 |
Journal volume | 40 |
Journal issue | 12 |
Pages of publication | 10267 |
a | 14.5946 ± 0.0003 Å |
b | 12.2931 ± 0.0002 Å |
c | 14.917 ± 0.0003 Å |
α | 90° |
β | 90° |
γ | 90° |
Cell volume | 2676.3 ± 0.09 Å3 |
Cell temperature | 296 ± 2 K |
Ambient diffraction temperature | 296 ± 2 K |
Number of distinct elements | 6 |
Space group number | 61 |
Hermann-Mauguin space group symbol | P b c a |
Hall space group symbol | -P 2ac 2ab |
Residual factor for all reflections | 0.0345 |
Residual factor for significantly intense reflections | 0.0221 |
Weighted residual factors for significantly intense reflections | 0.0508 |
Weighted residual factors for all reflections included in the refinement | 0.0537 |
Goodness-of-fit parameter for all reflections included in the refinement | 1.067 |
Diffraction radiation wavelength | 0.71073 Å |
Diffraction radiation type | MoKα |