Information card for entry 7055839
Chemical name | cis-hydroxodichlorodipyridinenitrosylruthenium |
Formula | C10 H11 Cl2 N3 O2 Ru |
Calculated formula | C10 H11 Cl2 N3 O2 Ru |
SMILES | [Ru](Cl)(Cl)([n]1ccccc1)(N=O)([n]1ccccc1)O |
Title of publication | Synthesis and crystal structure of nitrosoruthenium complexes cis-[Ru(NO)Py2Cl2(OH)] and cis-[Ru(NO)Py2Cl2(H2O)]Cl. Photoinduced transformations of cis-[Ru(NO)Py2Cl2(OH)] |
Authors of publication | Makhinya, Alexander N.; Il’in, Maxim A.; Yamaletdinov, Ruslan D.; Korolkov, Ilya V.; Baidina, Iraida A. |
Journal of publication | New J. Chem. |
Year of publication | 2016 |
Journal volume | 40 |
Journal issue | 12 |
Pages of publication | 10267 |
a | 15.3824 ± 0.0004 Å |
b | 6.9222 ± 0.0002 Å |
c | 14.4655 ± 0.0003 Å |
α | 90° |
β | 117.818 ± 0.001° |
γ | 90° |
Cell volume | 1362.28 ± 0.06 Å3 |
Cell temperature | 296 ± 2 K |
Ambient diffraction temperature | 296 ± 2 K |
Number of distinct elements | 6 |
Space group number | 14 |
Hermann-Mauguin space group symbol | P 1 21/c 1 |
Hall space group symbol | -P 2ybc |
Residual factor for all reflections | 0.0614 |
Residual factor for significantly intense reflections | 0.0313 |
Weighted residual factors for significantly intense reflections | 0.0616 |
Weighted residual factors for all reflections included in the refinement | 0.0673 |
Goodness-of-fit parameter for all reflections included in the refinement | 0.964 |
Diffraction radiation wavelength | 0.71073 Å |
Diffraction radiation type | MoKα |