Information card for entry 7055948
Formula | C14 H28 F6 N8 O8 S2 Zn |
Calculated formula | C14 H28 F6 N8 O8 S2 Zn |
Title of publication | Trinuclear (aminonitrone)ZnII complexes as key intermediates in zinc(ii)-mediated generation of 1,2,4-oxadiazoles from amidoximes and nitriles |
Authors of publication | Bolotin, Dmitrii S.; Il'in, Mikhail V.; Novikov, Alexander S.; Bokach, Nadezhda A.; Suslonov, Vitalii V.; Kukushkin, Vadim Yu. |
Journal of publication | New J. Chem. |
Year of publication | 2017 |
Journal volume | 41 |
Journal issue | 5 |
Pages of publication | 1940 |
a | 16.8415 ± 0.0003 Å |
b | 20.4363 ± 0.0004 Å |
c | 16.1946 ± 0.0003 Å |
α | 90° |
β | 90° |
γ | 90° |
Cell volume | 5573.82 ± 0.18 Å3 |
Cell temperature | 100 ± 2 K |
Ambient diffraction temperature | 100 ± 2 K |
Number of distinct elements | 7 |
Space group number | 33 |
Hermann-Mauguin space group symbol | P n a 21 |
Hall space group symbol | P 2c -2n |
Residual factor for all reflections | 0.0489 |
Residual factor for significantly intense reflections | 0.042 |
Weighted residual factors for significantly intense reflections | 0.0983 |
Weighted residual factors for all reflections included in the refinement | 0.1023 |
Goodness-of-fit parameter for all reflections included in the refinement | 1.046 |
Diffraction radiation wavelength | 0.71073 Å |
Diffraction radiation type | MoKα |