Information card for entry 7055952
Formula | C36 H50 F12 N8 O26 S4 Zn3 |
Calculated formula | C36 H50 F12 N8 O26 S4 Zn3 |
Title of publication | Trinuclear (aminonitrone)ZnII complexes as key intermediates in zinc(ii)-mediated generation of 1,2,4-oxadiazoles from amidoximes and nitriles |
Authors of publication | Bolotin, Dmitrii S.; Il'in, Mikhail V.; Novikov, Alexander S.; Bokach, Nadezhda A.; Suslonov, Vitalii V.; Kukushkin, Vadim Yu. |
Journal of publication | New J. Chem. |
Year of publication | 2017 |
Journal volume | 41 |
Journal issue | 5 |
Pages of publication | 1940 |
a | 9.9101 ± 0.0006 Å |
b | 17.0394 ± 0.0009 Å |
c | 18.2463 ± 0.0006 Å |
α | 74.733 ± 0.004° |
β | 89.846 ± 0.004° |
γ | 82.485 ± 0.005° |
Cell volume | 2945.2 ± 0.3 Å3 |
Cell temperature | 100 ± 2 K |
Ambient diffraction temperature | 100 ± 2 K |
Number of distinct elements | 7 |
Space group number | 2 |
Hermann-Mauguin space group symbol | P -1 |
Hall space group symbol | -P 1 |
Residual factor for all reflections | 0.1152 |
Residual factor for significantly intense reflections | 0.0793 |
Weighted residual factors for significantly intense reflections | 0.2065 |
Weighted residual factors for all reflections included in the refinement | 0.2495 |
Goodness-of-fit parameter for all reflections included in the refinement | 1.02 |
Diffraction radiation wavelength | 1.54184 Å |
Diffraction radiation type | CuKα |