Information card for entry 7055970
Formula | C6 H8 N10 O10 |
Calculated formula | C6 H8 N10 O10 |
SMILES | c1(nnc(C(=N([O-])=O)N(=O)=O)o1)c1nnc(C(=N([O-])=O)N(=O)=O)o1.[NH4+].[NH4+] |
Title of publication | Energetic compounds featuring bi(1,3,4-oxadiazole): a new family of insensitive energetic materials |
Authors of publication | Tian, Jiawei; Xiong, Hualin; Lin, Qiuhan; Cheng, Guangbin; Yang, Hongwei |
Journal of publication | New J. Chem. |
Year of publication | 2017 |
Journal volume | 41 |
Journal issue | 5 |
Pages of publication | 1918 |
a | 6.7135 ± 0.0006 Å |
b | 6.7702 ± 0.0006 Å |
c | 8.1378 ± 0.0007 Å |
α | 80.267 ± 0.003° |
β | 76.307 ± 0.003° |
γ | 74.335 ± 0.003° |
Cell volume | 343.82 ± 0.05 Å3 |
Cell temperature | 173 ± 2 K |
Ambient diffraction temperature | 173 ± 2 K |
Number of distinct elements | 4 |
Space group number | 2 |
Hermann-Mauguin space group symbol | P -1 |
Hall space group symbol | -P 1 |
Residual factor for all reflections | 0.0476 |
Residual factor for significantly intense reflections | 0.0338 |
Weighted residual factors for significantly intense reflections | 0.0801 |
Weighted residual factors for all reflections included in the refinement | 0.0855 |
Goodness-of-fit parameter for all reflections included in the refinement | 1.083 |
Diffraction radiation wavelength | 0.71073 Å |
Diffraction radiation type | MoKα |