Information card for entry 7056001
Formula | C24 H22 F12 N6 P2 |
Calculated formula | C24 H22 F12 N6 P2 |
SMILES | [P](F)(F)(F)(F)(F)[F-].C(c1cc(ccc1)C[n+]1ccn(c1)c1ncccc1)[n+]1cn(c2ccccn2)cc1.[P](F)(F)(F)(F)(F)[F-] |
Title of publication | Structural diversities in Ag(i) complexes of xylyl platform based isomeric bis-NHC ligands: effects of pyridine wingtip substituents |
Authors of publication | Jana, Barun; Ghosh, Pradyut |
Journal of publication | New J. Chem. |
Year of publication | 2017 |
Journal volume | 41 |
Journal issue | 5 |
Pages of publication | 2131 |
a | 12.345 ± 0.002 Å |
b | 10.001 ± 0.002 Å |
c | 22.409 ± 0.004 Å |
α | 90° |
β | 90.856 ± 0.005° |
γ | 90° |
Cell volume | 2766.4 ± 0.9 Å3 |
Cell temperature | 150 ± 2 K |
Ambient diffraction temperature | 150 ± 2 K |
Number of distinct elements | 5 |
Space group number | 14 |
Hermann-Mauguin space group symbol | P 1 21/n 1 |
Hall space group symbol | -P 2yn |
Residual factor for all reflections | 0.1236 |
Residual factor for significantly intense reflections | 0.0864 |
Weighted residual factors for significantly intense reflections | 0.2074 |
Weighted residual factors for all reflections included in the refinement | 0.2361 |
Goodness-of-fit parameter for all reflections included in the refinement | 1.01 |
Diffraction radiation wavelength | 0.71073 Å |
Diffraction radiation type | MoKα |