Information card for entry 7056007
Formula | C20 H18 Cu N3 O3 |
Calculated formula | C20 H18 Cu N3 O3 |
Title of publication | Copper(ii) complexes with benzhydrazone-related ligands: synthesis, structural studies and cytotoxicity assay |
Authors of publication | Cindrić, Marina; Bjelopetrović, Alen; Pavlović, Gordana; Damjanović, Vladimir; Lovrić, Jasna; Matković-Čalogović, Dubravka; Vrdoljak, Višnja |
Journal of publication | New J. Chem. |
Year of publication | 2017 |
Journal volume | 41 |
Journal issue | 6 |
Pages of publication | 2425 |
a | 11.3899 ± 0.0003 Å |
b | 7.9499 ± 0.0002 Å |
c | 20.1358 ± 0.0005 Å |
α | 90° |
β | 99.746 ± 0.002° |
γ | 90° |
Cell volume | 1796.95 ± 0.08 Å3 |
Cell temperature | 150 ± 2 K |
Ambient diffraction temperature | 150 ± 2 K |
Number of distinct elements | 5 |
Space group number | 14 |
Hermann-Mauguin space group symbol | P 1 21/n 1 |
Hall space group symbol | -P 2yn |
Residual factor for all reflections | 0.0425 |
Residual factor for significantly intense reflections | 0.0378 |
Weighted residual factors for significantly intense reflections | 0.0956 |
Weighted residual factors for all reflections included in the refinement | 0.0985 |
Goodness-of-fit parameter for all reflections included in the refinement | 1.06 |
Diffraction radiation wavelength | 0.71073 Å |
Diffraction radiation type | MoKα |