Information card for entry 7056021
Formula | C19 H18 Cl2 N2 O Ru S2 |
Calculated formula | C19 H18 Cl2 N2 O Ru S2 |
SMILES | [Ru]12345(Cl)(Cl)([S]=C(NC(=O)c6sccc6)NCc6ccccc6)[cH]6[cH]1[cH]2[cH]3[cH]4[cH]56 |
Title of publication | Synthesis of Ru(ii)‒benzene complexes containing aroylthiourea ligands, and their binding with biomolecules and in vitro cytotoxicity through apoptosis |
Authors of publication | Jeyalakshmi, Kumaramangalam; Haribabu, Jebiti; Balachandran, Chandrasekar; Bhuvanesh, Nattamai S. P.; Emi, Nobuhiko; Karvembu, Ramasamy |
Journal of publication | New J. Chem. |
Year of publication | 2017 |
Journal volume | 41 |
Journal issue | 7 |
Pages of publication | 2672 |
a | 6.5098 ± 0.0019 Å |
b | 11.428 ± 0.003 Å |
c | 14.534 ± 0.004 Å |
α | 101.993 ± 0.003° |
β | 95.432 ± 0.004° |
γ | 105.472 ± 0.003° |
Cell volume | 1006.3 ± 0.5 Å3 |
Cell temperature | 110.15 K |
Ambient diffraction temperature | 110.15 K |
Number of distinct elements | 7 |
Space group number | 2 |
Hermann-Mauguin space group symbol | P -1 |
Hall space group symbol | -P 1 |
Residual factor for all reflections | 0.0441 |
Residual factor for significantly intense reflections | 0.0399 |
Weighted residual factors for significantly intense reflections | 0.1051 |
Weighted residual factors for all reflections included in the refinement | 0.1089 |
Goodness-of-fit parameter for all reflections included in the refinement | 1.043 |
Diffraction radiation wavelength | 0.71073 Å |
Diffraction radiation type | MoKα |