Information card for entry 7056031
Formula | C16 H12 Cl N O Pd S |
Calculated formula | C16 H12 Cl N O Pd S |
SMILES | [Pd]12([S](c3ccccc3)Cc3ccc4c([n]23)c(O1)ccc4)Cl |
Title of publication | Oxine based unsymmetrical (O−, N, S/Se) pincer ligands and their palladium(ii) complexes: synthesis, structural aspects and applications as a catalyst in amine and copper-free Sonogashira coupling |
Authors of publication | Kumar, Satyendra; Saleem, Fariha; Mishra, Manish Kumar; Singh, Ajai K. |
Journal of publication | New J. Chem. |
Year of publication | 2017 |
Journal volume | 41 |
Journal issue | 7 |
Pages of publication | 2745 |
a | 9.222 ± 0.003 Å |
b | 12.461 ± 0.004 Å |
c | 13.128 ± 0.004 Å |
α | 90° |
β | 100.199 ± 0.005° |
γ | 90° |
Cell volume | 1484.8 ± 0.8 Å3 |
Cell temperature | 298 ± 2 K |
Ambient diffraction temperature | 298 ± 2 K |
Number of distinct elements | 7 |
Space group number | 14 |
Hermann-Mauguin space group symbol | P 1 21/c 1 |
Hall space group symbol | -P 2ybc |
Residual factor for all reflections | 0.0861 |
Residual factor for significantly intense reflections | 0.0485 |
Weighted residual factors for significantly intense reflections | 0.1031 |
Weighted residual factors for all reflections included in the refinement | 0.1162 |
Goodness-of-fit parameter for all reflections included in the refinement | 0.974 |
Diffraction radiation wavelength | 0.71073 Å |
Diffraction radiation type | MoKα |