Information card for entry 7056817
Common name | Ni(2-MIm)2[Fe(CN)5NO]2H2O |
Chemical name | Nikel bis-2-methylimidazole Nitrosylpentacyanoferrate (III) dihydrate |
Formula | C26 Fe2 N20 Ni2 O6 |
Calculated formula | C26 Fe2 N20 Ni2 O6 |
Title of publication | New coordination polymers based on 2-methylimidazole and transition metal nitroprusside containing building blocks: synthesis, structure and magnetic properties |
Authors of publication | Di Santo, A.; Osiry, H.; Reguera, E.; Alborés, P.; Carbonio, R. E.; Ben Altabef, A.; Gil, Diego M. |
Journal of publication | New Journal of Chemistry |
Year of publication | 2018 |
Journal volume | 42 |
Journal issue | 2 |
Pages of publication | 1347 |
a | 19.0005 ± 0.0002 Å |
b | 14.7563 ± 0.0001 Å |
c | 7.1233 ± 0.0005 Å |
α | 90° |
β | 90° |
γ | 90° |
Cell volume | 1997.21 ± 0.14 Å3 |
Cell temperature | 298 K |
Ambient diffraction temperature | 298 K |
Number of distinct elements | 5 |
Space group number | 19 |
Hermann-Mauguin space group symbol | P 21 21 21 |
Hall space group symbol | P 2ac 2ab |
Residual factor for significantly intense reflections | 0.0922 |
Weighted residual factors for all reflections included in the refinement | 0.127 |
Residual factor R(I) for significantly intense reflections | 7.253 |
Goodness-of-fit parameter for all reflections | 1.769 |
Method of determination | powder diffraction |
Diffraction radiation wavelength | 1.5406 Å |
Diffraction radiation type | CuKα |